AccueilAccueil  FAQFAQ  RechercherRechercher  S'enregistrerS'enregistrer  MembresMembres  Connexion  

Partagez | 
 

 problème compilation andoid

Voir le sujet précédent Voir le sujet suivant Aller en bas 
AuteurMessage
stradaSC
Nouveau


Messages : 1

MessageSujet: problème compilation andoid   Dim 13 Nov 2016 - 12:43

Voilà j'ai recemment fini le développement d'un de mes jeu (sur android),
Tous fonctionne parfaitement en mode test mais au moment de compilé l'APK rien ne marche. Voici mon LOG de compilation:
Code:
Create started: 13:36:03
"C:\Users\ROGER\AppData\Roaming\GameMaker-Studio\GMAssetCompiler.exe" /fU="C:\GMtemp\gm_ttt_73621\a10884.txt" /c /m=android   /config="Default" /tgt=8 /obob=True /obpp=False /obru=True /obes=False /i=3 /cvm /tp=1024 /mv=1 /iv=0 /rv=0 /bv=1757 /gn="Space Slalom" /td="C:\GMtemp" /cd="C:\GMtemp\cache" /sh=True /dbgp="6502" /hip="192.168.0.100" /hprt="51268" /optionsini="C:\GMtemp\gm_ttt_73621\gm_ttt_93594\Space Slalom-Default-1.0.12.ini" /o="C:\GMtemp\gm_ttt_73621\gm_ttt_93594" "C:\Users\ROGER\Documents\GameMaker\Projects\Space Slalom.gmx\Space Slalom.project.gmx"

Reading project file....finished.
Compile Constants...finished.
Remove DnD...finished.
Compile Scripts...finished.
Compile Objects...finished.
Compile Timelines...finished.
Compile Triggers...finished.
Compile Rooms...finished.
Compile Extensions...finished.
Final Compile...finished.
Saving IFF file... C:\GMtemp\gm_ttt_73621\gm_ttt_93594\Space Slalom.droid
Writing Chunk... GEN8
Writing Chunk... OPTN
Writing Chunk... EXTN
Writing Chunk... SOND
*writing audio file c:\gmtemp\gm_ttt_73621\gm_ttt_93594\sound0.ogg...
Writing Chunk... AGRP
Writing Chunk... SPRT
Warning : resource sprt_line_0 rescaled from 1080,50 to 540,25
Warning : resource sprt_line_aside_0 rescaled from 50,1920 to 25,960
Writing Chunk... BGND
Warning : resource background1_0 rescaled from 1080,1920 to 540,960
Writing Chunk... PATH
Writing Chunk... SCPT
Writing Chunk... SHDR
Writing Chunk... FONT
Warning : resource font2_0 rescaled from 2048,1024 to 1024,512
Writing Chunk... TMLN
Writing Chunk... OBJT
Writing Chunk... ROOM
Writing Chunk... DAFL
Writing Chunk... TPAGE
Writing Chunk... CODE
Writing Chunk... VARI
Writing Chunk... FUNC
Writing Chunk... STRG
Writing Chunk... TXTR
0 Compressing texture... writing texture texture_0.png...
1 Compressing texture... writing texture texture_1.png...
2 Compressing texture... writing texture texture_2.png...
Writing Chunk... AUDO
Writing Chunk... SCPT
Writing Chunk... DBGI
Writing Chunk... INST
Writing Chunk... LOCL
Writing Chunk... STRG
Stats : GMA : Elapsed=5202,0399
Stats : GMA : sp=10,au=1,bk=1,pt=0,sc=2,sh=0,fo=2,tl=0,ob=12,ro=2,da=0,ex=0,ma=10,fm=0x9202860
cmd /c ""C:\Users\ROGER\AppData\Roaming\GameMaker-Studio\Android\runner\gradle\gradlew"" build -x assembleDebug

:com.SCGames.SpaceSlalom:preBuild UP-TO-DATE
:com.SCGames.SpaceSlalom:preReleaseBuild UP-TO-DATE
:com.SCGames.SpaceSlalom:checkReleaseManifest
:com.SCGames.SpaceSlalom:preDebugBuild UP-TO-DATE
:com.SCGames.SpaceSlalom:prepareComAndroidSupportMultidex101Library UP-TO-DATE
:com.SCGames.SpaceSlalom:prepareComAndroidSupportSupportV42311Library UP-TO-DATE
:com.SCGames.SpaceSlalom:prepareReleaseDependencies
:com.SCGames.SpaceSlalom:compileReleaseAidl UP-TO-DATE
:com.SCGames.SpaceSlalom:compileReleaseRenderscript UP-TO-DATE
:com.SCGames.SpaceSlalom:generateReleaseBuildConfig
:com.SCGames.SpaceSlalom:generateReleaseAssets UP-TO-DATE
:com.SCGames.SpaceSlalom:mergeReleaseAssets
:com.SCGames.SpaceSlalom:generateReleaseResValues UP-TO-DATE
:com.SCGames.SpaceSlalom:generateReleaseResources UP-TO-DATE
:com.SCGames.SpaceSlalom:mergeReleaseResources UP-TO-DATE
:com.SCGames.SpaceSlalom:processArmeabi-v7aReleaseManifest
Warning: C:\GMtemp\cache\Space Slalom\Android\Default\com.SCGames.SpaceSlalom\src\main\AndroidManifest.xml:24:3-63:17 Warning:
 application@android:label was tagged at AndroidManifest.xml:24 to replace other declarations but no other declaration present
Warning: C:\GMtemp\cache\Space Slalom\Android\Default\com.SCGames.SpaceSlalom\src\main\AndroidManifest.xml:25:5-31:16 Warning:
 activity#com.SCGames.SpaceSlalom.RunnerActivity@android:label was tagged at AndroidManifest.xml:25 to replace other declarations but no other declaration present
C:\GMtemp\cache\Space Slalom\Android\Default\com.SCGames.SpaceSlalom\src\main\AndroidManifest.xml:24:3-63:17 Warning:
 application@android:label was tagged at AndroidManifest.xml:24 to replace other declarations but no other declaration present
C:\GMtemp\cache\Space Slalom\Android\Default\com.SCGames.SpaceSlalom\src\main\AndroidManifest.xml:25:5-31:16 Warning:
 activity#com.SCGames.SpaceSlalom.RunnerActivity@android:label was tagged at AndroidManifest.xml:25 to replace other declarations but no other declaration present
:com.SCGames.SpaceSlalom:processArmeabi-v7aReleaseResources
:com.SCGames.SpaceSlalom:processArmeabiReleaseManifest
Warning: C:\GMtemp\cache\Space Slalom\Android\Default\com.SCGames.SpaceSlalom\src\main\AndroidManifest.xml:24:3-63:17 Warning:
 application@android:label was tagged at AndroidManifest.xml:24 to replace other declarations but no other declaration present
Warning: C:\GMtemp\cache\Space Slalom\Android\Default\com.SCGames.SpaceSlalom\src\main\AndroidManifest.xml:25:5-31:16 Warning:
 activity#com.SCGames.SpaceSlalom.RunnerActivity@android:label was tagged at AndroidManifest.xml:25 to replace other declarations but no other declaration present
C:\GMtemp\cache\Space Slalom\Android\Default\com.SCGames.SpaceSlalom\src\main\AndroidManifest.xml:24:3-63:17 Warning:
 application@android:label was tagged at AndroidManifest.xml:24 to replace other declarations but no other declaration present
C:\GMtemp\cache\Space Slalom\Android\Default\com.SCGames.SpaceSlalom\src\main\AndroidManifest.xml:25:5-31:16 Warning:
 activity#com.SCGames.SpaceSlalom.RunnerActivity@android:label was tagged at AndroidManifest.xml:25 to replace other declarations but no other declaration present
:com.SCGames.SpaceSlalom:processArmeabiReleaseResources
:com.SCGames.SpaceSlalom:processMipsReleaseManifest
Warning: C:\GMtemp\cache\Space Slalom\Android\Default\com.SCGames.SpaceSlalom\src\main\AndroidManifest.xml:24:3-63:17 Warning:
 application@android:label was tagged at AndroidManifest.xml:24 to replace other declarations but no other declaration present
Warning: C:\GMtemp\cache\Space Slalom\Android\Default\com.SCGames.SpaceSlalom\src\main\AndroidManifest.xml:25:5-31:16 Warning:
 activity#com.SCGames.SpaceSlalom.RunnerActivity@android:label was tagged at AndroidManifest.xml:25 to replace other declarations but no other declaration present
C:\GMtemp\cache\Space Slalom\Android\Default\com.SCGames.SpaceSlalom\src\main\AndroidManifest.xml:24:3-63:17 Warning:
 application@android:label was tagged at AndroidManifest.xml:24 to replace other declarations but no other declaration present
C:\GMtemp\cache\Space Slalom\Android\Default\com.SCGames.SpaceSlalom\src\main\AndroidManifest.xml:25:5-31:16 Warning:
 activity#com.SCGames.SpaceSlalom.RunnerActivity@android:label was tagged at AndroidManifest.xml:25 to replace other declarations but no other declaration present
:com.SCGames.SpaceSlalom:processMipsReleaseResources
:com.SCGames.SpaceSlalom:processUniversalReleaseManifest
Warning: C:\GMtemp\cache\Space Slalom\Android\Default\com.SCGames.SpaceSlalom\src\main\AndroidManifest.xml:24:3-63:17 Warning:
 application@android:label was tagged at AndroidManifest.xml:24 to replace other declarations but no other declaration present
Warning: C:\GMtemp\cache\Space Slalom\Android\Default\com.SCGames.SpaceSlalom\src\main\AndroidManifest.xml:25:5-31:16 Warning:
 activity#com.SCGames.SpaceSlalom.RunnerActivity@android:label was tagged at AndroidManifest.xml:25 to replace other declarations but no other declaration present
C:\GMtemp\cache\Space Slalom\Android\Default\com.SCGames.SpaceSlalom\src\main\AndroidManifest.xml:24:3-63:17 Warning:
 application@android:label was tagged at AndroidManifest.xml:24 to replace other declarations but no other declaration present
C:\GMtemp\cache\Space Slalom\Android\Default\com.SCGames.SpaceSlalom\src\main\AndroidManifest.xml:25:5-31:16 Warning:
 activity#com.SCGames.SpaceSlalom.RunnerActivity@android:label was tagged at AndroidManifest.xml:25 to replace other declarations but no other declaration present
:com.SCGames.SpaceSlalom:processUniversalReleaseResources
:com.SCGames.SpaceSlalom:processX86ReleaseManifest
Warning: C:\GMtemp\cache\Space Slalom\Android\Default\com.SCGames.SpaceSlalom\src\main\AndroidManifest.xml:24:3-63:17 Warning:
 application@android:label was tagged at AndroidManifest.xml:24 to replace other declarations but no other declaration present
Warning: C:\GMtemp\cache\Space Slalom\Android\Default\com.SCGames.SpaceSlalom\src\main\AndroidManifest.xml:25:5-31:16 Warning:
 activity#com.SCGames.SpaceSlalom.RunnerActivity@android:label was tagged at AndroidManifest.xml:25 to replace other declarations but no other declaration present
C:\GMtemp\cache\Space Slalom\Android\Default\com.SCGames.SpaceSlalom\src\main\AndroidManifest.xml:24:3-63:17 Warning:
 application@android:label was tagged at AndroidManifest.xml:24 to replace other declarations but no other declaration present
C:\GMtemp\cache\Space Slalom\Android\Default\com.SCGames.SpaceSlalom\src\main\AndroidManifest.xml:25:5-31:16 Warning:
 activity#com.SCGames.SpaceSlalom.RunnerActivity@android:label was tagged at AndroidManifest.xml:25 to replace other declarations but no other declaration present
:com.SCGames.SpaceSlalom:processX86ReleaseResources
:com.SCGames.SpaceSlalom:generateReleaseSources
:com.SCGames.SpaceSlalom:processReleaseJavaRes UP-TO-DATE
:com.SCGames.SpaceSlalom:compileReleaseJavaWithJavacC:\GMtemp\cache\Space Slalom\Android\Default\com.SCGames.SpaceSlalom\src\main\java\com\SCGames\SpaceSlalom\ExpansionAlarmReceiver.java:3: error: package com.google.android.vending.expansion.downloader does not exist
import com.google.android.vending.expansion.downloader.DownloaderClientMarshaller;
                                                      ^
C:\GMtemp\cache\Space Slalom\Android\Default\com.SCGames.SpaceSlalom\src\main\java\com\SCGames\SpaceSlalom\ExpansionDownloaderService.java:3: error: package com.google.android.vending.expansion.downloader.impl does not exist
import com.google.android.vending.expansion.downloader.impl.DownloaderService;
                                                           ^
C:\GMtemp\cache\Space Slalom\Android\Default\com.SCGames.SpaceSlalom\src\main\java\com\SCGames\SpaceSlalom\ExpansionDownloaderService.java:6: error: cannot find symbol
public class ExpansionDownloaderService extends DownloaderService {
                                                ^
  symbol: class DownloaderService
C:\GMtemp\cache\Space Slalom\Android\Default\com.SCGames.SpaceSlalom\src\main\java\com\SCGames\SpaceSlalom\GooglePlayLicensingAsExt.java:10: error: package com.google.android.vending.licensing does not exist
import com.google.android.vending.licensing.LicenseChecker;
                                           ^
C:\GMtemp\cache\Space Slalom\Android\Default\com.SCGames.SpaceSlalom\src\main\java\com\SCGames\SpaceSlalom\GooglePlayLicensingAsExt.java:11: error: package com.google.android.vending.licensing does not exist
import com.google.android.vending.licensing.LicenseCheckerCallback;
                                           ^
C:\GMtemp\cache\Space Slalom\Android\Default\com.SCGames.SpaceSlalom\src\main\java\com\SCGames\SpaceSlalom\GooglePlayLicensingAsExt.java:12: error: package com.google.android.vending.licensing does not exist
import com.google.android.vending.licensing.Obfuscator;
                                           ^
C:\GMtemp\cache\Space Slalom\Android\Default\com.SCGames.SpaceSlalom\src\main\java\com\SCGames\SpaceSlalom\GooglePlayLicensingAsExt.java:13: error: package com.google.android.vending.licensing does not exist
import com.google.android.vending.licensing.ServerManagedPolicy;
                                           ^
C:\GMtemp\cache\Space Slalom\Android\Default\com.SCGames.SpaceSlalom\src\main\java\com\SCGames\SpaceSlalom\GooglePlayLicensingAsExt.java:14: error: package com.google.android.vending.licensing does not exist
import com.google.android.vending.licensing.AESObfuscator;
                                           ^
C:\GMtemp\cache\Space Slalom\Android\Default\com.SCGames.SpaceSlalom\src\main\java\com\SCGames\SpaceSlalom\GooglePlayLicensingAsExt.java:15: error: package com.google.android.vending.licensing does not exist
import com.google.android.vending.licensing.Policy;
                                           ^
C:\GMtemp\cache\Space Slalom\Android\Default\com.SCGames.SpaceSlalom\src\main\java\com\SCGames\SpaceSlalom\GooglePlayLicensingAsExt.java:30: error: cannot find symbol
    private LicenseCheckerCallback mLicenseCheckerCallback;
            ^
  symbol:   class LicenseCheckerCallback
  location: class GooglePlayLicensingAsExt
C:\GMtemp\cache\Space Slalom\Android\Default\com.SCGames.SpaceSlalom\src\main\java\com\SCGames\SpaceSlalom\GooglePlayLicensingAsExt.java:31: error: cannot find symbol
    private LicenseChecker mChecker;  
            ^
  symbol:   class LicenseChecker
  location: class GooglePlayLicensingAsExt
C:\GMtemp\cache\Space Slalom\Android\Default\com.SCGames.SpaceSlalom\src\main\java\com\SCGames\SpaceSlalom\GooglePlayLicensingAsExt.java:34: error: cannot find symbol
 private class MyLicenseCheckerCallback implements LicenseCheckerCallback
                                                   ^
  symbol:   class LicenseCheckerCallback
  location: class GooglePlayLicensingAsExt
C:\GMtemp\cache\Space Slalom\Android\Default\com.SCGames.SpaceSlalom\src\main\java\com\SCGames\SpaceSlalom\PlayAPKExpansionExtension.java:36: error: package com.google.android.vending.expansion.downloader does not exist
import com.google.android.vending.expansion.downloader.Constants;
                                                      ^
C:\GMtemp\cache\Space Slalom\Android\Default\com.SCGames.SpaceSlalom\src\main\java\com\SCGames\SpaceSlalom\PlayAPKExpansionExtension.java:37: error: package com.google.android.vending.expansion.downloader does not exist
import com.google.android.vending.expansion.downloader.DownloadProgressInfo;
                                                      ^
C:\GMtemp\cache\Space Slalom\Android\Default\com.SCGames.SpaceSlalom\src\main\java\com\SCGames\SpaceSlalom\PlayAPKExpansionExtension.java:38: error: package com.google.android.vending.expansion.downloader does not exist
import com.google.android.vending.expansion.downloader.DownloaderClientMarshaller;
                                                      ^
C:\GMtemp\cache\Space Slalom\Android\Default\com.SCGames.SpaceSlalom\src\main\java\com\SCGames\SpaceSlalom\PlayAPKExpansionExtension.java:39: error: package com.google.android.vending.expansion.downloader does not exist
import com.google.android.vending.expansion.downloader.DownloaderServiceMarshaller;
                                                      ^
C:\GMtemp\cache\Space Slalom\Android\Default\com.SCGames.SpaceSlalom\src\main\java\com\SCGames\SpaceSlalom\PlayAPKExpansionExtension.java:40: error: package com.google.android.vending.expansion.downloader does not exist
import com.google.android.vending.expansion.downloader.Helpers;
                                                      ^
C:\GMtemp\cache\Space Slalom\Android\Default\com.SCGames.SpaceSlalom\src\main\java\com\SCGames\SpaceSlalom\PlayAPKExpansionExtension.java:41: error: package com.google.android.vending.expansion.downloader does not exist
import com.google.android.vending.expansion.downloader.IDownloaderClient;
                                                      ^
C:\GMtemp\cache\Space Slalom\Android\Default\com.SCGames.SpaceSlalom\src\main\java\com\SCGames\SpaceSlalom\PlayAPKExpansionExtension.java:42: error: package com.google.android.vending.expansion.downloader does not exist
import com.google.android.vending.expansion.downloader.IDownloaderService;
                                                      ^
C:\GMtemp\cache\Space Slalom\Android\Default\com.SCGames.SpaceSlalom\src\main\java\com\SCGames\SpaceSlalom\PlayAPKExpansionExtension.java:43: error: package com.google.android.vending.expansion.downloader does not exist
import com.google.android.vending.expansion.downloader.IStub;
                                                      ^
C:\GMtemp\cache\Space Slalom\Android\Default\com.SCGames.SpaceSlalom\src\main\java\com\SCGames\SpaceSlalom\PlayAPKExpansionExtension.java:46: error: cannot find symbol
public class PlayAPKExpansionExtension extends RunnerSocial  implements IDownloaderClient
                                                                        ^
  symbol: class IDownloaderClient
C:\GMtemp\cache\Space Slalom\Android\Default\com.SCGames.SpaceSlalom\src\main\java\com\SCGames\SpaceSlalom\PlayAPKExpansionExtension.java:51: error: cannot find symbol
 private IDownloaderService mRemoteService;
        ^
  symbol:   class IDownloaderService
  location: class PlayAPKExpansionExtension
C:\GMtemp\cache\Space Slalom\Android\Default\com.SCGames.SpaceSlalom\src\main\java\com\SCGames\SpaceSlalom\PlayAPKExpansionExtension.java:52: error: cannot find symbol
    private IStub mDownloaderClientStub;
            ^
  symbol:   class IStub
  location: class PlayAPKExpansionExtension
C:\GMtemp\cache\Space Slalom\Android\Default\com.SCGames.SpaceSlalom\src\main\java\com\SCGames\SpaceSlalom\PlayAPKExpansionExtension.java:203: error: cannot find symbol
    public void onDownloadProgress(DownloadProgressInfo progress)
                                   ^
  symbol:   class DownloadProgressInfo
  location: class PlayAPKExpansionExtension
C:\GMtemp\cache\Space Slalom\Android\Default\com.SCGames.SpaceSlalom\src\main\java\com\SCGames\SpaceSlalom\ExpansionAlarmReceiver.java:22: error: cannot find symbol
            DownloaderClientMarshaller.startDownloadServiceIfRequired(context, intent, ExpansionDownloaderService.class);
            ^
  symbol:   variable DownloaderClientMarshaller
  location: class ExpansionAlarmReceiver
C:\GMtemp\cache\Space Slalom\Android\Default\com.SCGames.SpaceSlalom\src\main\java\com\SCGames\SpaceSlalom\ExpansionDownloaderService.java:19: error: method does not override or implement a method from a supertype
    @Override
    ^
C:\GMtemp\cache\Space Slalom\Android\Default\com.SCGames.SpaceSlalom\src\main\java\com\SCGames\SpaceSlalom\ExpansionDownloaderService.java:31: error: method does not override or implement a method from a supertype
    @Override
    ^
C:\GMtemp\cache\Space Slalom\Android\Default\com.SCGames.SpaceSlalom\src\main\java\com\SCGames\SpaceSlalom\ExpansionDownloaderService.java:42: error: method does not override or implement a method from a supertype
    @Override
    ^
C:\GMtemp\cache\Space Slalom\Android\Default\com.SCGames.SpaceSlalom\src\main\java\com\SCGames\SpaceSlalom\GooglePlayLicensingAsExt.java:56: error: cannot find symbol
   if (reason == Policy.RETRY) {
                ^
  symbol:   variable Policy
  location: class GooglePlayLicensingAsExt.MyLicenseCheckerCallback
C:\GMtemp\cache\Space Slalom\Android\Default\com.SCGames.SpaceSlalom\src\main\java\com\SCGames\SpaceSlalom\GooglePlayLicensingAsExt.java:139: error: cannot find symbol
         ServerManagedPolicy policy = new ServerManagedPolicy( RunnerActivity.CurrentActivity, new AESObfuscator( RunnerActivity.CurrentActivity.SALT, RunnerActivity.CurrentActivity.getPackageName(), deviceId));
         ^
  symbol:   class ServerManagedPolicy
  location: class GooglePlayLicensingAsExt
C:\GMtemp\cache\Space Slalom\Android\Default\com.SCGames.SpaceSlalom\src\main\java\com\SCGames\SpaceSlalom\GooglePlayLicensingAsExt.java:139: error: cannot find symbol
         ServerManagedPolicy policy = new ServerManagedPolicy( RunnerActivity.CurrentActivity, new AESObfuscator( RunnerActivity.CurrentActivity.SALT, RunnerActivity.CurrentActivity.getPackageName(), deviceId));
                                         ^
  symbol:   class ServerManagedPolicy
  location: class GooglePlayLicensingAsExt
C:\GMtemp\cache\Space Slalom\Android\Default\com.SCGames.SpaceSlalom\src\main\java\com\SCGames\SpaceSlalom\GooglePlayLicensingAsExt.java:139: error: cannot find symbol
         ServerManagedPolicy policy = new ServerManagedPolicy( RunnerActivity.CurrentActivity, new AESObfuscator( RunnerActivity.CurrentActivity.SALT, RunnerActivity.CurrentActivity.getPackageName(), deviceId));
                                                                                                  ^
  symbol:   class AESObfuscator
  location: class GooglePlayLicensingAsExt
C:\GMtemp\cache\Space Slalom\Android\Default\com.SCGames.SpaceSlalom\src\main\java\com\SCGames\SpaceSlalom\GooglePlayLicensingAsExt.java:146: error: cannot find symbol
         mChecker = new LicenseChecker( RunnerActivity.CurrentActivity, policy, RunnerActivity.BASE64_PUBLIC_KEY);
                       ^
  symbol:   class LicenseChecker
  location: class GooglePlayLicensingAsExt
C:\GMtemp\cache\Space Slalom\Android\Default\com.SCGames.SpaceSlalom\src\main\java\com\SCGames\SpaceSlalom\PlayAPKExpansionExtension.java:96: error: method does not override or implement a method from a supertype
    @Override
    ^
C:\GMtemp\cache\Space Slalom\Android\Default\com.SCGames.SpaceSlalom\src\main\java\com\SCGames\SpaceSlalom\PlayAPKExpansionExtension.java:99: error: cannot find symbol
        mRemoteService = DownloaderServiceMarshaller.CreateProxy(m);
                         ^
  symbol:   variable DownloaderServiceMarshaller
  location: class PlayAPKExpansionExtension
C:\GMtemp\cache\Space Slalom\Android\Default\com.SCGames.SpaceSlalom\src\main\java\com\SCGames\SpaceSlalom\PlayAPKExpansionExtension.java:103: error: method does not override or implement a method from a supertype
    @Override
    ^
C:\GMtemp\cache\Space Slalom\Android\Default\com.SCGames.SpaceSlalom\src\main\java\com\SCGames\SpaceSlalom\PlayAPKExpansionExtension.java:107: error: cannot find symbol
 stringDownloadID = Helpers.getDownloaderStringResourceIDFromState(newState);
                   ^
  symbol:   variable Helpers
  location: class PlayAPKExpansionExtension
C:\GMtemp\cache\Space Slalom\Android\Default\com.SCGames.SpaceSlalom\src\main\java\com\SCGames\SpaceSlalom\PlayAPKExpansionExtension.java:118: error: cannot find symbol
            case IDownloaderClient.STATE_IDLE:
                 ^
  symbol:   variable IDownloaderClient
  location: class PlayAPKExpansionExtension
C:\GMtemp\cache\Space Slalom\Android\Default\com.SCGames.SpaceSlalom\src\main\java\com\SCGames\SpaceSlalom\PlayAPKExpansionExtension.java:124: error: cannot find symbol
            case IDownloaderClient.STATE_CONNECTING:
                 ^
  symbol:   variable IDownloaderClient
  location: class PlayAPKExpansionExtension
C:\GMtemp\cache\Space Slalom\Android\Default\com.SCGames.SpaceSlalom\src\main\java\com\SCGames\SpaceSlalom\PlayAPKExpansionExtension.java:125: error: cannot find symbol
            case IDownloaderClient.STATE_FETCHING_URL:
                 ^
  symbol:   variable IDownloaderClient
  location: class PlayAPKExpansionExtension
C:\GMtemp\cache\Space Slalom\Android\Default\com.SCGames.SpaceSlalom\src\main\java\com\SCGames\SpaceSlalom\PlayAPKExpansionExtension.java:130: error: cannot find symbol
            case IDownloaderClient.STATE_DOWNLOADING:
                 ^
  symbol:   variable IDownloaderClient
  location: class PlayAPKExpansionExtension
C:\GMtemp\cache\Space Slalom\Android\Default\com.SCGames.SpaceSlalom\src\main\java\com\SCGames\SpaceSlalom\PlayAPKExpansionExtension.java:136: error: cannot find symbol
            case IDownloaderClient.STATE_FAILED_CANCELED:
                 ^
  symbol:   variable IDownloaderClient
  location: class PlayAPKExpansionExtension
C:\GMtemp\cache\Space Slalom\Android\Default\com.SCGames.SpaceSlalom\src\main\java\com\SCGames\SpaceSlalom\PlayAPKExpansionExtension.java:137: error: cannot find symbol
            case IDownloaderClient.STATE_FAILED:
                 ^
  symbol:   variable IDownloaderClient
  location: class PlayAPKExpansionExtension
C:\GMtemp\cache\Space Slalom\Android\Default\com.SCGames.SpaceSlalom\src\main\java\com\SCGames\SpaceSlalom\PlayAPKExpansionExtension.java:138: error: cannot find symbol
            case IDownloaderClient.STATE_FAILED_FETCHING_URL:
                 ^
  symbol:   variable IDownloaderClient
  location: class PlayAPKExpansionExtension
C:\GMtemp\cache\Space Slalom\Android\Default\com.SCGames.SpaceSlalom\src\main\java\com\SCGames\SpaceSlalom\PlayAPKExpansionExtension.java:139: error: cannot find symbol
            case IDownloaderClient.STATE_FAILED_UNLICENSED:
                 ^
  symbol:   variable IDownloaderClient
  location: class PlayAPKExpansionExtension
C:\GMtemp\cache\Space Slalom\Android\Default\com.SCGames.SpaceSlalom\src\main\java\com\SCGames\SpaceSlalom\PlayAPKExpansionExtension.java:144: error: cannot find symbol
            case IDownloaderClient.STATE_PAUSED_NEED_CELLULAR_PERMISSION:
                 ^
  symbol:   variable IDownloaderClient
  location: class PlayAPKExpansionExtension
C:\GMtemp\cache\Space Slalom\Android\Default\com.SCGames.SpaceSlalom\src\main\java\com\SCGames\SpaceSlalom\PlayAPKExpansionExtension.java:145: error: cannot find symbol
            case IDownloaderClient.STATE_PAUSED_WIFI_DISABLED_NEED_CELLULAR_PERMISSION:
                 ^
  symbol:   variable IDownloaderClient
  location: class PlayAPKExpansionExtension
C:\GMtemp\cache\Space Slalom\Android\Default\com.SCGames.SpaceSlalom\src\main\java\com\SCGames\SpaceSlalom\PlayAPKExpansionExtension.java:152: error: cannot find symbol
            case IDownloaderClient.STATE_PAUSED_BY_REQUEST:
                 ^
  symbol:   variable IDownloaderClient
  location: class PlayAPKExpansionExtension
C:\GMtemp\cache\Space Slalom\Android\Default\com.SCGames.SpaceSlalom\src\main\java\com\SCGames\SpaceSlalom\PlayAPKExpansionExtension.java:156: error: cannot find symbol
            case IDownloaderClient.STATE_PAUSED_ROAMING:
                 ^
  symbol:   variable IDownloaderClient
  location: class PlayAPKExpansionExtension
C:\GMtemp\cache\Space Slalom\Android\Default\com.SCGames.SpaceSlalom\src\main\java\com\SCGames\SpaceSlalom\PlayAPKExpansionExtension.java:157: error: cannot find symbol
            case IDownloaderClient.STATE_PAUSED_SDCARD_UNAVAILABLE:
                 ^
  symbol:   variable IDownloaderClient
  location: class PlayAPKExpansionExtension
C:\GMtemp\cache\Space Slalom\Android\Default\com.SCGames.SpaceSlalom\src\main\java\com\SCGames\SpaceSlalom\PlayAPKExpansionExtension.java:161: error: cannot find symbol
            case IDownloaderClient.STATE_COMPLETED:
                 ^
  symbol:   variable IDownloaderClient
  location: class PlayAPKExpansionExtension
C:\GMtemp\cache\Space Slalom\Android\Default\com.SCGames.SpaceSlalom\src\main\java\com\SCGames\SpaceSlalom\PlayAPKExpansionExtension.java:202: error: method does not override or implement a method from a supertype
 @Override
 ^
C:\GMtemp\cache\Space Slalom\Android\Default\com.SCGames.SpaceSlalom\src\main\java\com\SCGames\SpaceSlalom\PlayAPKExpansionExtension.java:205: error: cannot find symbol
        mAverageSpeed.setText(RunnerActivity.CurrentActivity.getString(R.string.kilobytes_per_second, Helpers.getSpeedString(progress.mCurrentSpeed)));
                                                                               ^
  symbol:   variable kilobytes_per_second
  location: class string
C:\GMtemp\cache\Space Slalom\Android\Default\com.SCGames.SpaceSlalom\src\main\java\com\SCGames\SpaceSlalom\PlayAPKExpansionExtension.java:205: error: cannot find symbol
        mAverageSpeed.setText(RunnerActivity.CurrentActivity.getString(R.string.kilobytes_per_second, Helpers.getSpeedString(progress.mCurrentSpeed)));
                                                                                                      ^
  symbol:   variable Helpers
  location: class PlayAPKExpansionExtension
C:\GMtemp\cache\Space Slalom\Android\Default\com.SCGames.SpaceSlalom\src\main\java\com\SCGames\SpaceSlalom\PlayAPKExpansionExtension.java:206: error: cannot find symbol
        mTimeRemaining.setText(RunnerActivity.CurrentActivity.getString(R.string.time_remaining,Helpers.getTimeRemaining(progress.mTimeRemaining)));
                                                                                ^
  symbol:   variable time_remaining
  location: class string
C:\GMtemp\cache\Space Slalom\Android\Default\com.SCGames.SpaceSlalom\src\main\java\com\SCGames\SpaceSlalom\PlayAPKExpansionExtension.java:206: error: cannot find symbol
        mTimeRemaining.setText(RunnerActivity.CurrentActivity.getString(R.string.time_remaining,Helpers.getTimeRemaining(progress.mTimeRemaining)));
                                                                                                ^
  symbol:   variable Helpers
  location: class PlayAPKExpansionExtension
C:\GMtemp\cache\Space Slalom\Android\Default\com.SCGames.SpaceSlalom\src\main\java\com\SCGames\SpaceSlalom\PlayAPKExpansionExtension.java:212: error: cannot find symbol
        mProgressFraction.setText(Helpers.getDownloadProgressString(progress.mOverallProgress, progress.mOverallTotal));
                                  ^
  symbol:   variable Helpers
  location: class PlayAPKExpansionExtension
C:\GMtemp\cache\Space Slalom\Android\Default\com.SCGames.SpaceSlalom\src\main\java\com\SCGames\SpaceSlalom\PlayAPKExpansionExtension.java:237: error: cannot find symbol
                int startResult = DownloaderClientMarshaller.startDownloadServiceIfRequired(RunnerActivity.CurrentActivity, pendingIntent, ExpansionDownloaderService.class);
                                  ^
  symbol:   variable DownloaderClientMarshaller
  location: class PlayAPKExpansionExtension
C:\GMtemp\cache\Space Slalom\Android\Default\com.SCGames.SpaceSlalom\src\main\java\com\SCGames\SpaceSlalom\PlayAPKExpansionExtension.java:239: error: cannot find symbol
                if (startResult != DownloaderClientMarshaller.NO_DOWNLOAD_REQUIRED)
                                   ^
  symbol:   variable DownloaderClientMarshaller
  location: class PlayAPKExpansionExtension
C:\GMtemp\cache\Space Slalom\Android\Default\com.SCGames.SpaceSlalom\src\main\java\com\SCGames\SpaceSlalom\PlayAPKExpansionExtension.java:255: error: cannot find symbol
 mDownloaderClientStub = DownloaderClientMarshaller.CreateStub(this, ExpansionDownloaderService.class);
                        ^
  symbol:   variable DownloaderClientMarshaller
  location: class PlayAPKExpansionExtension
C:\GMtemp\cache\Space Slalom\Android\Default\com.SCGames.SpaceSlalom\src\main\java\com\SCGames\SpaceSlalom\PlayAPKExpansionExtension.java:321: error: cannot find symbol
                mRemoteService.setDownloadFlags(IDownloaderService.FLAGS_DOWNLOAD_OVER_CELLULAR);
                                                ^
  symbol: variable IDownloaderService
C:\GMtemp\cache\Space Slalom\Android\Default\com.SCGames.SpaceSlalom\src\main\java\com\SCGames\SpaceSlalom\PlayAPKExpansionExtension.java:331: error: cannot find symbol
            mStatusText.setText(Helpers.getDownloaderStringResourceIDFromState(newState));
                                ^
  symbol:   variable Helpers
  location: class PlayAPKExpansionExtension
C:\GMtemp\cache\Space Slalom\Android\Default\com.SCGames.SpaceSlalom\src\main\java\com\SCGames\SpaceSlalom\PlayAPKExpansionExtension.java:353: error: cannot find symbol
 String filename = Helpers.getExpansionAPKFileName( RunnerActivity.CurrentActivity, true, versionCode ); //without path
                  ^
  symbol:   variable Helpers
  location: class PlayAPKExpansionExtension
C:\GMtemp\cache\Space Slalom\Android\Default\com.SCGames.SpaceSlalom\src\main\java\com\SCGames\SpaceSlalom\PlayAPKExpansionExtension.java:354: error: cannot find symbol
 String filePath = Helpers.generateSaveFileName( RunnerActivity.CurrentActivity, filename ); //+path
                  ^
  symbol:   variable Helpers
  location: class PlayAPKExpansionExtension
Note: Some input files use or override a deprecated API.
Note: Recompile with -Xlint:deprecation for details.
Note: C:\GMtemp\cache\Space Slalom\Android\Default\com.SCGames.SpaceSlalom\src\main\java\com\SCGames\SpaceSlalom\Gamepad\Gamepad.java uses unchecked or unsafe operations.
Note: Recompile with -Xlint:unchecked for details.
64 errors
 FAILED

FAILURE: Build failed with an exception.

* What went wrong:
Execution failed for task ':com.SCGames.SpaceSlalom:compileReleaseJavaWithJavac'.
> Compilation failed; see the compiler error output for details.

* Try:
Run with --stacktrace option to get the stack trace. Run with --info or --debug option to get more log output.

BUILD FAILED

Total time: 9.597 secs
Create finished: 13:36:20
voici des screen de mon SDK:
http://prntscr.com/d6or8u
http://prntscr.com/d6orfm
http://prntscr.com/d6orkj
http://prntscr.com/d6oruw

voici des screen des paramétré de GM:
http://prntscr.com/d6osfa
http://prntscr.com/d6osk6
http://prntscr.com/d6osn1
http://prntscr.com/d6ospp
http://prntscr.com/d6oss7
http://prntscr.com/d6osxj
Revenir en haut Aller en bas
 
problème compilation andoid
Voir le sujet précédent Voir le sujet suivant Revenir en haut 
Page 1 sur 1
 Sujets similaires
-
» Les apiculteurs parlent des OGM de leur problèmes face a l'envahisseur...
» Problème application eyeliner !!!!
» Problème de déglutition
» Problème Linguistique (Conjugaison)
» pas de travail pas de problème

Permission de ce forum:Vous ne pouvez pas répondre aux sujets dans ce forum
Forum Le CBNA :: Développement :: Entraide confirmés-
Sauter vers: